{"text_format":"1","workbook":"xlsx","n_sheets":8,"sheets":["Menu","Int","Ext","Quadrante Swot","Plano","Gra","Instruções","Parametros"],"not_rendered":{"charts":2,"images":10,"macros":1,"external_links":0,"defined_names":0,"comments":0,"pivot_tables":0},"unopened":[],"bounds":{"document_bytes":16777216,"sheet_cells":100000,"rows_first":2000,"rows_last":500,"rows_between":2000,"halvings":0,"cell_chars":16384,"cell_head_chars":4096},"cells_cut":0,"cells_raw":0,"read":"whole","date_system":"1900"}

{"sheet":"Menu","index":0,"n_rows":26,"n_cols":7,"rows_kept":26,"cut":false,"hidden":false,"merged":[[25,4,25,5],[25,6,25,14]]}
[]
[]
[]
[]
[]
[]
[]
[]
[]
[]
[]
[]
[]
[]
[]
[]
[]
[]
[]
[]
[]
[]
[]
[]
[]
[null,null,null,null,"Empresa:",null,"Empresa ABCDE"]

{"sheet":"Int","index":1,"n_rows":190,"n_cols":16,"rows_kept":190,"cut":false,"hidden":false,"merged":[[11,1,12,1],[11,2,12,2],[11,3,12,3],[9,2,9,5],[11,4,12,4],[11,5,12,5]]}
[]
[]
[]
[]
[]
[]
[]
[]
[]
[null,"Empresa:",{"$f":"Menu!G26","v":"Empresa ABCDE"}]
[]
[null,"FATORES INTERNOS","ATENDIMENTO","IMPORTÂNCIA","PONTUAÇÃO","ANÁLISE"]
[]
[{"$f":"IF(OR(B14=\"Digite aqui(Produto ou serviço)\",B14=\"\"),\"\",IF(AND(O14=1,P14=1),\"Abacaxi\",IF(AND(O14=2,P14=1),\"Questionamento\",IF(AND(O14=2,P14=2),\"Estrela\",\"Vaca Leiteira\"))))","v":"Estrela"},"Relação entre os funcionários","Atende razoavelmente","Muito importante",{"$f":"IF(OR(C14=\"\",D14=\"\"),\"\",VLOOKUP(G14,Parametros!$A$4:$C$12,2,0))","v":5},{"$f":"IF(OR(C14=\"\",D14=\"\"),\"\",VLOOKUP(G14,Parametros!$A$4:$C$12,3,0))","v":"FORÇA"},{"$f":"CONCATENATE(C14,\"-\",D14)","v":"Atende razoavelmente-Muito importante"},null,null,null,null,null,null,null,{"$f":"IF(C14=\"\",\"\",IF(C14=\"Mercado estagnado ou em queda\",1,2))","v":2},{"$f":"IF(D14=\"\",\"\",IF(D14=\"Pouca Participação\",1,2))","v":2}]
[{"$f":"IF(OR(B15=\"Digite aqui(Produto ou serviço)\",B15=\"\"),\"\",IF(AND(O15=1,P15=1),\"Abacaxi\",IF(AND(O15=2,P15=1),\"Questionamento\",IF(AND(O15=2,P15=2),\"Estrela\",\"Vaca Leiteira\"))))","v":"Estrela"},"Rotatividade de funcionário","Não atende","Muito importante",{"$f":"IF(OR(C15=\"\",D15=\"\"),\"\",VLOOKUP(G15,Parametros!$A$4:$C$12,2,0))","v":-10},{"$f":"IF(OR(C15=\"\",D15=\"\"),\"\",VLOOKUP(G15,Parametros!$A$4:$C$12,3,0))","v":"FRAQUEZA"},{"$f":"CONCATENATE(C15,\"-\",D15)","v":"Não atende-Muito importante"},null,null,null,null,null,null,null,{"$f":"IF(C15=\"\",\"\",IF(C15=\"Mercado estagnado ou em queda\",1,2))","v":2},{"$f":"IF(D15=\"\",\"\",IF(D15=\"Pouca Participação\",1,2))","v":2}]
["Estrela","Custo do produto","Atende totalmente","Importante",{"$f":"IF(OR(C16=\"\",D16=\"\"),\"\",VLOOKUP(G16,Parametros!$A$4:$C$12,2,0))","v":8},{"$f":"IF(OR(C16=\"\",D16=\"\"),\"\",VLOOKUP(G16,Parametros!$A$4:$C$12,3,0))","v":"FORÇA"},"Atende totalmente-Importante",null,null,null,null,null,null,null,2,2]
[{"$f":"IF(OR(B17=\"Digite aqui(Produto ou serviço)\",B17=\"\"),\"\",IF(AND(O17=1,P17=1),\"Abacaxi\",IF(AND(O17=2,P17=1),\"Questionamento\",IF(AND(O17=2,P17=2),\"Estrela\",\"Vaca Leiteira\"))))","v":"Estrela"},"Qualidade do produto","Atende totalmente","Muito importante",{"$f":"IF(OR(C17=\"\",D17=\"\"),\"\",VLOOKUP(G17,Parametros!$A$4:$C$12,2,0))","v":10},{"$f":"IF(OR(C17=\"\",D17=\"\"),\"\",VLOOKUP(G17,Parametros!$A$4:$C$12,3,0))","v":"FORÇA"},"Atende totalmente-Muito importante",null,null,null,null,null,null,null,2,2]
["Estrela","Localização da empresa","Atende totalmente","Insignificante",{"$f":"IF(OR(C18=\"\",D18=\"\"),\"\",VLOOKUP(G18,Parametros!$A$4:$C$12,2,0))","v":-10},{"$f":"IF(OR(C18=\"\",D18=\"\"),\"\",VLOOKUP(G18,Parametros!$A$4:$C$12,3,0))","v":"FRAQUEZA"},"Atende totalmente-Insignificante",null,null,null,null,null,null,null,2,2]
["Estrela","Conhecimento das operações internas","Atende razoavelmente","Insignificante",{"$f":"IF(OR(C19=\"\",D19=\"\"),\"\",VLOOKUP(G19,Parametros!$A$4:$C$12,2,0))","v":-5},{"$f":"IF(OR(C19=\"\",D19=\"\"),\"\",VLOOKUP(G19,Parametros!$A$4:$C$12,3,0))","v":"FRAQUEZA"},"Atende razoavelmente-Insignificante",null,null,null,null,null,null,null,2,2]
["Estrela","Diferenciação do produto","Atende totalmente","Insignificante",{"$f":"IF(OR(C20=\"\",D20=\"\"),\"\",VLOOKUP(G20,Parametros!$A$4:$C$12,2,0))","v":-10},{"$f":"IF(OR(C20=\"\",D20=\"\"),\"\",VLOOKUP(G20,Parametros!$A$4:$C$12,3,0))","v":"FRAQUEZA"},"Atende totalmente-Insignificante",null,null,null,null,null,null,null,2,2]
["Estrela","Capacidade da empresa","Atende razoavelmente","Insignificante",{"$f":"IF(OR(C21=\"\",D21=\"\"),\"\",VLOOKUP(G21,Parametros!$A$4:$C$12,2,0))","v":-5},{"$f":"IF(OR(C21=\"\",D21=\"\"),\"\",VLOOKUP(G21,Parametros!$A$4:$C$12,3,0))","v":"FRAQUEZA"},"Atende razoavelmente-Insignificante",null,null,null,null,null,null,null,2,2]
["Estrela","Relação com o fornecedor","Atende totalmente","Insignificante",{"$f":"IF(OR(C22=\"\",D22=\"\"),\"\",VLOOKUP(G22,Parametros!$A$4:$C$12,2,0))","v":-10},{"$f":"IF(OR(C22=\"\",D22=\"\"),\"\",VLOOKUP(G22,Parametros!$A$4:$C$12,3,0))","v":"FRAQUEZA"},"Atende totalmente-Insignificante",null,null,null,null,null,null,null,2,2]
["Estrela","Relação de longo prazo","Atende razoavelmente","Importante",{"$f":"IF(OR(C23=\"\",D23=\"\"),\"\",VLOOKUP(G23,Parametros!$A$4:$C$12,2,0))","v":2},{"$f":"IF(OR(C23=\"\",D23=\"\"),\"\",VLOOKUP(G23,Parametros!$A$4:$C$12,3,0))","v":"FORÇA"},"Atende razoavelmente-Importante",null,null,null,null,null,null,null,2,2]
["Estrela","Capacitação dos funcionários","Não atende","Muito importante",{"$f":"IF(OR(C24=\"\",D24=\"\"),\"\",VLOOKUP(G24,Parametros!$A$4:$C$12,2,0))","v":-10},{"$f":"IF(OR(C24=\"\",D24=\"\"),\"\",VLOOKUP(G24,Parametros!$A$4:$C$12,3,0))","v":"FRAQUEZA"},"Não atende-Muito importante",null,null,null,null,null,null,null,2,2]
["Estrela","Perfil Inovador","Atende razoavelmente","Muito importante",{"$f":"IF(OR(C25=\"\",D25=\"\"),\"\",VLOOKUP(G25,Parametros!$A$4:$C$12,2,0))","v":5},{"$f":"IF(OR(C25=\"\",D25=\"\"),\"\",VLOOKUP(G25,Parametros!$A$4:$C$12,3,0))","v":"FORÇA"},"Atende razoavelmente-Muito importante",null,null,null,null,null,null,null,2,2]
["Estrela","Capacidade de atendimento aos clientes","Atende totalmente","Importante",{"$f":"IF(OR(C26=\"\",D26=\"\"),\"\",VLOOKUP(G26,Parametros!$A$4:$C$12,2,0))","v":8},{"$f":"IF(OR(C26=\"\",D26=\"\"),\"\",VLOOKUP(G26,Parametros!$A$4:$C$12,3,0))","v":"FORÇA"},"Atende totalmente-Importante",null,null,null,null,null,null,null,{"$f":"IF(C26=\"\",\"\",IF(C26=\"Mercado estagnado ou em queda\",1,2))","v":2},{"$f":"IF(D26=\"\",\"\",IF(D26=\"Pouca Participação\",1,2))","v":2}]
["Estrela","Conhecimento sobre a concorrência","Não atende","Muito importante",{"$f":"IF(OR(C27=\"\",D27=\"\"),\"\",VLOOKUP(G27,Parametros!$A$4:$C$12,2,0))","v":-10},{"$f":"IF(OR(C27=\"\",D27=\"\"),\"\",VLOOKUP(G27,Parametros!$A$4:$C$12,3,0))","v":"FRAQUEZA"},"Não atende-Muito importante",null,null,null,null,null,null,null,2,2]
["",null,null,null,{"$f":"IF(OR(C28=\"\",D28=\"\"),\"\",VLOOKUP(G28,Parametros!$A$4:$C$12,2,0))","v":""},{"$f":"IF(OR(C28=\"\",D28=\"\"),\"\",VLOOKUP(G28,Parametros!$A$4:$C$12,3,0))","v":""},{"$f":"CONCATENATE(C28,\"-\",D28)","v":"-"},null,null,null,null,null,null,null,"",""]
["",null,null,null,{"$f":"IF(OR(C29=\"\",D29=\"\"),\"\",VLOOKUP(G29,Parametros!$A$4:$C$12,2,0))","v":""},{"$f":"IF(OR(C29=\"\",D29=\"\"),\"\",VLOOKUP(G29,Parametros!$A$4:$C$12,3,0))","v":""},"-",null,null,null,null,null,null,null,"",""]
["",null,null,null,{"$f":"IF(OR(C30=\"\",D30=\"\"),\"\",VLOOKUP(G30,Parametros!$A$4:$C$12,2,0))","v":""},{"$f":"IF(OR(C30=\"\",D30=\"\"),\"\",VLOOKUP(G30,Parametros!$A$4:$C$12,3,0))","v":""},"-",null,null,null,null,null,null,null,"",""]
["",null,null,null,{"$f":"IF(OR(C31=\"\",D31=\"\"),\"\",VLOOKUP(G31,Parametros!$A$4:$C$12,2,0))","v":""},{"$f":"IF(OR(C31=\"\",D31=\"\"),\"\",VLOOKUP(G31,Parametros!$A$4:$C$12,3,0))","v":""},"-",null,null,null,null,null,null,null,"",""]
["",null,null,null,{"$f":"IF(OR(C32=\"\",D32=\"\"),\"\",VLOOKUP(G32,Parametros!$A$4:$C$12,2,0))","v":""},{"$f":"IF(OR(C32=\"\",D32=\"\"),\"\",VLOOKUP(G32,Parametros!$A$4:$C$12,3,0))","v":""},"-",null,null,null,null,null,null,null,"",""]
["",null,null,null,{"$f":"IF(OR(C33=\"\",D33=\"\"),\"\",VLOOKUP(G33,Parametros!$A$4:$C$12,2,0))","v":""},{"$f":"IF(OR(C33=\"\",D33=\"\"),\"\",VLOOKUP(G33,Parametros!$A$4:$C$12,3,0))","v":""},"-",null,null,null,null,null,null,null,"",""]
["",null,null,null,null,null,null,null,null,null,null,null,null,null,"",""]
["",null,null,null,null,null,null,null,null,null,null,null,null,null,"",""]
["",null,null,null,null,null,null,null,null,null,null,null,null,null,"",""]
["",null,null,null,null,null,null,null,null,null,null,null,null,null,"",""]
["",null,null,null,null,null,null,null,null,null,null,null,null,null,"",""]
["",null,null,null,null,null,null,null,null,null,null,null,null,null,"",""]
["",null,null,null,null,null,null,null,null,null,null,null,null,null,"",""]
{"$rows_left_out":151}
{"sheet":"Ext","index":2,"n_rows":190,"n_cols":16,"rows_kept":190,"cut":false,"hidden":false,"merged":[[9,2,9,5],[11,1,12,1],[11,2,12,2],[11,3,12,3],[11,4,12,4],[11,5,12,5]]}
[]
[]
[]
[]
[]
[]
[]
[]
[]
[null,"Empresa:",{"$f":"Menu!G26","v":"Empresa ABCDE"}]
[]
[null,"FATORES EXTERNOS","MOMENTO","IMPORTÂNCIA","PONTUAÇÃO","ANÁLISE"]
[]
[{"$f":"IF(OR(B14=\"Digite aqui(Produto ou serviço)\",B14=\"\"),\"\",IF(AND(O14=1,P14=1),\"Abacaxi\",IF(AND(O14=2,P14=1),\"Questionamento\",IF(AND(O14=2,P14=2),\"Estrela\",\"Vaca Leiteira\"))))","v":"Estrela"},"Desenvolvimento tecnológico na área","Favorável","Muito importante",{"$f":"IF(OR(C14=\"\",D14=\"\"),\"\",VLOOKUP(G14,Parametros!$F$4:$H$12,2,0))","v":10},{"$f":"IF(OR(C14=\"\",D14=\"\"),\"\",VLOOKUP(G14,Parametros!$F$4:$H$12,3,0))","v":"OPORTUNIDADE"},{"$f":"CONCATENATE(C14,\"-\",D14)","v":"Favorável-Muito importante"},null,null,null,null,null,null,null,{"$f":"IF(C14=\"\",\"\",IF(C14=\"Mercado estagnado ou em queda\",1,2))","v":2},{"$f":"IF(D14=\"\",\"\",IF(D14=\"Pouca Participação\",1,2))","v":2}]
[{"$f":"IF(OR(B15=\"Digite aqui(Produto ou serviço)\",B15=\"\"),\"\",IF(AND(O15=1,P15=1),\"Abacaxi\",IF(AND(O15=2,P15=1),\"Questionamento\",IF(AND(O15=2,P15=2),\"Estrela\",\"Vaca Leiteira\"))))","v":"Estrela"},"Mercado em expansão","Favorável","Muito importante",{"$f":"IF(OR(C15=\"\",D15=\"\"),\"\",VLOOKUP(G15,Parametros!$F$4:$H$12,2,0))","v":10},{"$f":"IF(OR(C15=\"\",D15=\"\"),\"\",VLOOKUP(G15,Parametros!$F$4:$H$12,3,0))","v":"OPORTUNIDADE"},{"$f":"CONCATENATE(C15,\"-\",D15)","v":"Favorável-Muito importante"},null,null,null,null,null,null,null,{"$f":"IF(C15=\"\",\"\",IF(C15=\"Mercado estagnado ou em queda\",1,2))","v":2},{"$f":"IF(D15=\"\",\"\",IF(D15=\"Pouca Participação\",1,2))","v":2}]
["Estrela","Quantidade de alianças estratégicas","Desfavorável","Muito importante",{"$f":"IF(OR(C16=\"\",D16=\"\"),\"\",VLOOKUP(G16,Parametros!$F$4:$H$12,2,0))","v":-10},{"$f":"IF(OR(C16=\"\",D16=\"\"),\"\",VLOOKUP(G16,Parametros!$F$4:$H$12,3,0))","v":"AMEAÇA"},"Desfavorável-Muito importante",null,null,null,null,null,null,null,2,2]
[{"$f":"IF(OR(B17=\"Digite aqui(Produto ou serviço)\",B17=\"\"),\"\",IF(AND(O17=1,P17=1),\"Abacaxi\",IF(AND(O17=2,P17=1),\"Questionamento\",IF(AND(O17=2,P17=2),\"Estrela\",\"Vaca Leiteira\"))))","v":"Estrela"},"Demanda do produto / serviço","Desfavorável","Insignificante",{"$f":"IF(OR(C17=\"\",D17=\"\"),\"\",VLOOKUP(G17,Parametros!$F$4:$H$12,2,0))","v":0},{"$f":"IF(OR(C17=\"\",D17=\"\"),\"\",VLOOKUP(G17,Parametros!$F$4:$H$12,3,0))","v":"NEUTRO"},"Desfavorável-Insignificante",null,null,null,null,null,null,null,2,2]
["Estrela","Relevância das alianças estratégicas","Desfavorável","Importante",{"$f":"IF(OR(C18=\"\",D18=\"\"),\"\",VLOOKUP(G18,Parametros!$F$4:$H$12,2,0))","v":-8},{"$f":"IF(OR(C18=\"\",D18=\"\"),\"\",VLOOKUP(G18,Parametros!$F$4:$H$12,3,0))","v":"AMEAÇA"},"Desfavorável-Importante",null,null,null,null,null,null,null,2,2]
["Estrela","Quantidade de concorrentes","Favorável","Muito importante",{"$f":"IF(OR(C19=\"\",D19=\"\"),\"\",VLOOKUP(G19,Parametros!$F$4:$H$12,2,0))","v":10},{"$f":"IF(OR(C19=\"\",D19=\"\"),\"\",VLOOKUP(G19,Parametros!$F$4:$H$12,3,0))","v":"OPORTUNIDADE"},"Favorável-Muito importante",null,null,null,null,null,null,null,2,2]
["Estrela","Força dos concorrentes","Desfavorável","Insignificante",{"$f":"IF(OR(C20=\"\",D20=\"\"),\"\",VLOOKUP(G20,Parametros!$F$4:$H$12,2,0))","v":0},{"$f":"IF(OR(C20=\"\",D20=\"\"),\"\",VLOOKUP(G20,Parametros!$F$4:$H$12,3,0))","v":"NEUTRO"},"Desfavorável-Insignificante",null,null,null,null,null,null,null,2,2]
["Estrela","Guerra de preços","Favorável","Muito importante",{"$f":"IF(OR(C21=\"\",D21=\"\"),\"\",VLOOKUP(G21,Parametros!$F$4:$H$12,2,0))","v":10},{"$f":"IF(OR(C21=\"\",D21=\"\"),\"\",VLOOKUP(G21,Parametros!$F$4:$H$12,3,0))","v":"OPORTUNIDADE"},"Favorável-Muito importante",null,null,null,null,null,null,null,2,2]
["Estrela","Situação do mercado (crise / expansão)","Neutro","Insignificante",{"$f":"IF(OR(C22=\"\",D22=\"\"),\"\",VLOOKUP(G22,Parametros!$F$4:$H$12,2,0))","v":0},{"$f":"IF(OR(C22=\"\",D22=\"\"),\"\",VLOOKUP(G22,Parametros!$F$4:$H$12,3,0))","v":"NEUTRO"},"Neutro-Insignificante",null,null,null,null,null,null,null,2,2]
["Estrela","Estabilidade Política","Favorável","Insignificante",{"$f":"IF(OR(C23=\"\",D23=\"\"),\"\",VLOOKUP(G23,Parametros!$F$4:$H$12,2,0))","v":0},{"$f":"IF(OR(C23=\"\",D23=\"\"),\"\",VLOOKUP(G23,Parametros!$F$4:$H$12,3,0))","v":"NEUTRO"},"Favorável-Insignificante",null,null,null,null,null,null,null,2,2]
["Estrela","Incentivos do governo","Neutro","Insignificante",{"$f":"IF(OR(C24=\"\",D24=\"\"),\"\",VLOOKUP(G24,Parametros!$F$4:$H$12,2,0))","v":0},{"$f":"IF(OR(C24=\"\",D24=\"\"),\"\",VLOOKUP(G24,Parametros!$F$4:$H$12,3,0))","v":"NEUTRO"},"Neutro-Insignificante",null,null,null,null,null,null,null,2,2]
["Estrela","Recursos disponíveis","Favorável","Muito importante",{"$f":"IF(OR(C25=\"\",D25=\"\"),\"\",VLOOKUP(G25,Parametros!$F$4:$H$12,2,0))","v":10},{"$f":"IF(OR(C25=\"\",D25=\"\"),\"\",VLOOKUP(G25,Parametros!$F$4:$H$12,3,0))","v":"OPORTUNIDADE"},"Favorável-Muito importante",null,null,null,null,null,null,null,2,2]
["Estrela","Barreiras para o desenvolvimento","Favorável","Insignificante",{"$f":"IF(OR(C26=\"\",D26=\"\"),\"\",VLOOKUP(G26,Parametros!$F$4:$H$12,2,0))","v":0},{"$f":"IF(OR(C26=\"\",D26=\"\"),\"\",VLOOKUP(G26,Parametros!$F$4:$H$12,3,0))","v":"NEUTRO"},"Favorável-Insignificante",null,null,null,null,null,null,null,2,2]
["Estrela","Facilidade ao acesso a informações","Desfavorável","Muito importante",{"$f":"IF(OR(C27=\"\",D27=\"\"),\"\",VLOOKUP(G27,Parametros!$F$4:$H$12,2,0))","v":-10},{"$f":"IF(OR(C27=\"\",D27=\"\"),\"\",VLOOKUP(G27,Parametros!$F$4:$H$12,3,0))","v":"AMEAÇA"},"Desfavorável-Muito importante",null,null,null,null,null,null,null,2,2]
["",null,null,null,{"$f":"IF(OR(C28=\"\",D28=\"\"),\"\",VLOOKUP(G28,Parametros!$F$4:$H$12,2,0))","v":""},{"$f":"IF(OR(C28=\"\",D28=\"\"),\"\",VLOOKUP(G28,Parametros!$F$4:$H$12,3,0))","v":""},"-",null,null,null,null,null,null,null,"",""]
["",null,null,null,{"$f":"IF(OR(C29=\"\",D29=\"\"),\"\",VLOOKUP(G29,Parametros!$F$4:$H$12,2,0))","v":""},{"$f":"IF(OR(C29=\"\",D29=\"\"),\"\",VLOOKUP(G29,Parametros!$F$4:$H$12,3,0))","v":""},"-",null,null,null,null,null,null,null,"",""]
["",null,null,null,{"$f":"IF(OR(C30=\"\",D30=\"\"),\"\",VLOOKUP(G30,Parametros!$F$4:$H$12,2,0))","v":""},{"$f":"IF(OR(C30=\"\",D30=\"\"),\"\",VLOOKUP(G30,Parametros!$F$4:$H$12,3,0))","v":""},"-",null,null,null,null,null,null,null,"",""]
["",null,null,null,{"$f":"IF(OR(C31=\"\",D31=\"\"),\"\",VLOOKUP(G31,Parametros!$F$4:$H$12,2,0))","v":""},{"$f":"IF(OR(C31=\"\",D31=\"\"),\"\",VLOOKUP(G31,Parametros!$F$4:$H$12,3,0))","v":""},"-",null,null,null,null,null,null,null,"",""]
["",null,null,null,{"$f":"IF(OR(C32=\"\",D32=\"\"),\"\",VLOOKUP(G32,Parametros!$F$4:$H$12,2,0))","v":""},{"$f":"IF(OR(C32=\"\",D32=\"\"),\"\",VLOOKUP(G32,Parametros!$F$4:$H$12,3,0))","v":""},"-",null,null,null,null,null,null,null,"",""]
["",null,null,null,{"$f":"IF(OR(C33=\"\",D33=\"\"),\"\",VLOOKUP(G33,Parametros!$F$4:$H$12,2,0))","v":""},{"$f":"IF(OR(C33=\"\",D33=\"\"),\"\",VLOOKUP(G33,Parametros!$F$4:$H$12,3,0))","v":""},"-",null,null,null,null,null,null,null,"",""]
["",null,null,null,null,null,null,null,null,null,null,null,null,null,"",""]
["",null,null,null,null,null,null,null,null,null,null,null,null,null,"",""]
["",null,null,null,null,null,null,null,null,null,null,null,null,null,"",""]
["",null,null,null,null,null,null,null,null,null,null,null,null,null,"",""]
["",null,null,null,null,null,null,null,null,null,null,null,null,null,"",""]
["",null,null,null,null,null,null,null,null,null,null,null,null,null,"",""]
["",null,null,null,null,null,null,null,null,null,null,null,null,null,"",""]
{"$rows_left_out":151}
{"sheet":"Quadrante Swot","index":3,"n_rows":38,"n_cols":3,"rows_kept":38,"cut":false,"hidden":false,"merged":[[9,2,9,6]]}
[]
[]
[]
[]
[]
[]
[]
[]
[]
[null,"Empresa:",{"$f":"Menu!G26","v":"Empresa ABCDE"}]
[]
[null,"Força","Fraqueza"]
[null,"Relação entre os funcionários","Rotatividade de funcionário"]
[null,"Custo do produto","Localização da empresa"]
[null,"Qualidade do produto","Conhecimento das operações internas"]
[null,"Relação de longo prazo","Diferenciação do produto"]
[null,"Perfil Inovador","Capacidade da empresa"]
[null,"Capacidade de atendimento aos clientes","Relação com o fornecedor"]
[null,null,"Capacitação dos funcionários"]
[null,null,"Conhecimento sobre a concorrência"]
[]
[]
[]
[]
[]
[]
[]
[]
[]
[]
[]
[]
[null,"Oportunidade","Ameaça"]
[null,"Desenvolvimento tecnológico na área","Quantidade de alianças estratégicas"]
[null,"Mercado em expansão","Relevância das alianças estratégicas"]
[null,"Quantidade de concorrentes","Facilidade ao acesso a informações"]
[null,"Guerra de preços"]
[null,"Recursos disponíveis"]

{"sheet":"Plano","index":4,"n_rows":190,"n_cols":17,"rows_kept":190,"cut":false,"hidden":false,"merged":[[11,9,12,9],[11,7,12,7],[11,8,12,8],[9,2,9,6],[11,2,12,2],[11,1,12,1],[11,3,12,3],[11,4,12,4],[11,5,12,5],[11,6,12,6]]}
[]
[]
[]
[]
[]
[]
[]
[]
[]
[null,"Empresa:",{"$f":"Menu!G26","v":"Empresa ABCDE"}]
[]
[null,"Fator","O que Fazer?","Por que?","Onde?","Quem?","Quando?","Como?","Quanto?","Fator Detalhado"]
[]
[{"$f":"IF(OR(B14=\"Digite aqui(Produto ou serviço)\",B14=\"\"),\"\",IF(AND(P14=1,Q14=1),\"Abacaxi\",IF(AND(P14=2,Q14=1),\"Questionamento\",IF(AND(P14=2,Q14=2),\"Estrela\",\"Vaca Leiteira\"))))","v":"Estrela"},"Oportunidade","Criar plano de carreira","Para diminuir a rotatividade de funcionários","Empresa ABCDE","RH","Ano 2020","Implantação de ferramenta adequada","Recurso: 5 mil reais.",null,null,null,null,null,null,{"$f":"IF(D14=\"\",\"\",IF(D14=\"Mercado estagnado ou em queda\",1,2))","v":2},{"$f":"IF(E14=\"\",\"\",IF(E14=\"Pouca Participação\",1,2))","v":2}]
[{"$f":"IF(OR(B15=\"Digite aqui(Produto ou serviço)\",B15=\"\"),\"\",IF(AND(P15=1,Q15=1),\"Abacaxi\",IF(AND(P15=2,Q15=1),\"Questionamento\",IF(AND(P15=2,Q15=2),\"Estrela\",\"Vaca Leiteira\"))))","v":""},null,null,null,null,null,null,null,null,null,null,null,null,null,null,{"$f":"IF(D15=\"\",\"\",IF(D15=\"Mercado estagnado ou em queda\",1,2))","v":""},{"$f":"IF(E15=\"\",\"\",IF(E15=\"Pouca Participação\",1,2))","v":""}]
["",null,null,null,null,null,null,null,null,null,null,null,null,null,null,"",""]
[{"$f":"IF(OR(B17=\"Digite aqui(Produto ou serviço)\",B17=\"\"),\"\",IF(AND(P17=1,Q17=1),\"Abacaxi\",IF(AND(P17=2,Q17=1),\"Questionamento\",IF(AND(P17=2,Q17=2),\"Estrela\",\"Vaca Leiteira\"))))","v":""},null,null,null,null,null,null,null,null,null,null,null,null,null,null,"",""]
["",null,null,null,null,null,null,null,null,null,null,null,null,null,null,"",""]
["",null,null,null,null,null,null,null,null,null,null,null,null,null,null,"",""]
["",null,null,null,null,null,null,null,null,null,null,null,null,null,null,"",""]
["",null,null,null,null,null,null,null,null,null,null,null,null,null,null,"",""]
["",null,null,null,null,null,null,null,null,null,null,null,null,null,null,"",""]
["",null,null,null,null,null,null,null,null,null,null,null,null,null,null,"",""]
["",null,null,null,null,null,null,null,null,null,null,null,null,null,null,"",""]
["",null,null,null,null,null,null,null,null,null,null,null,null,null,null,"",""]
["",null,null,null,null,null,null,null,null,null,null,null,null,null,null,"",""]
["",null,null,null,null,null,null,null,null,null,null,null,null,null,null,"",""]
["",null,null,null,null,null,null,null,null,null,null,null,null,null,null,"",""]
["",null,null,null,null,null,null,null,null,null,null,null,null,null,null,"",""]
["",null,null,null,null,null,null,null,null,null,null,null,null,null,null,"",""]
["",null,null,null,null,null,null,null,null,null,null,null,null,null,null,"",""]
["",null,null,null,null,null,null,null,null,null,null,null,null,null,null,"",""]
["",null,null,null,null,null,null,null,null,null,null,null,null,null,null,"",""]
["",null,null,null,null,null,null,null,null,null,null,null,null,null,null,"",""]
["",null,null,null,null,null,null,null,null,null,null,null,null,null,null,"",""]
["",null,null,null,null,null,null,null,null,null,null,null,null,null,null,"",""]
["",null,null,null,null,null,null,null,null,null,null,null,null,null,null,"",""]
["",null,null,null,null,null,null,null,null,null,null,null,null,null,null,"",""]
["",null,null,null,null,null,null,null,null,null,null,null,null,null,null,"",""]
["",null,null,null,null,null,null,null,null,null,null,null,null,null,null,"",""]
{"$rows_left_out":151}
{"sheet":"Gra","index":5,"n_rows":20,"n_cols":4,"rows_kept":20,"cut":false,"hidden":false,"merged":[[9,1,9,2],[9,3,9,17],[19,1,20,2],[13,1,14,2],[15,1,16,2],[17,1,18,2],[13,3,14,5],[15,3,16,5],[17,3,18,5],[19,3,20,5]]}
[]
[]
[]
[]
[]
[]
[]
[]
[]
[null,"Empresa:",null,{"$f":"Menu!G26","v":"Empresa ABCDE"}]
[]
[]
[]
[null,{"$f":"Parametros!L3","v":38},null,"FORÇA"]
[]
[null,{"$f":"Parametros!L5","v":70},null,"FRAQUEZA"]
[]
[null,{"$f":"Parametros!L4","v":50},null,"OPORTUNIDADE"]
[]
[null,{"$f":"Parametros!L6","v":28},null,"AMEAÇA"]

{"sheet":"Instruções","index":6,"n_rows":0,"n_cols":0,"rows_kept":0,"cut":false,"hidden":false,"merged":[]}

{"sheet":"Parametros","index":7,"n_rows":12,"n_cols":13,"rows_kept":12,"cut":false,"hidden":false,"merged":[]}
["Fatores Internos",null,null,null,null,"Fatores Externos"]
[null,null,null,null,null,null,null,null,null,null,null,"Pontuação","Plano de Ação"]
["Critérios","Pontuação","Resultado",null,null,"Critérios","Pontuação","Resultado",null,null,"FORÇA",{"$f":"SUMIF(Int!E14:E33,\">0\")","v":38},{"$f":"COUNTIF(Plano!$B$14:$B$1048576,Parametros!K3)","v":0}]
["Não atende-Insignificante",0,"NEUTRO",null,null,"Desfavorável-Insignificante",0,"NEUTRO",null,null,"OPORTUNIDADE",{"$f":"SUMIF(Ext!E14:E33,\">0\")","v":50},{"$f":"COUNTIF(Plano!$B$14:$B$1048576,Parametros!K4)","v":1}]
["Não atende-Importante",-8,"FRAQUEZA",null,null,"Neutro-Insignificante",0,"NEUTRO",null,null,"FRAQUEZA",{"$f":"ABS(SUMIF(Int!E14:E33,\"<0\"))","v":70},{"$f":"COUNTIF(Plano!$B$14:$B$1048576,Parametros!K5)","v":0}]
["Não atende-Muito importante",-10,"FRAQUEZA",null,null,"Favorável-Insignificante",0,"NEUTRO",null,null,"AMEAÇA",{"$f":"ABS(SUMIF(Ext!E14:E33,\"<0\"))","v":28},{"$f":"COUNTIF(Plano!$B$14:$B$1048576,Parametros!K6)","v":0}]
["Atende razoavelmente-Insignificante",-5,"FRAQUEZA",null,null,"Desfavorável-Importante",-8,"AMEAÇA"]
["Atende razoavelmente-Importante",2,"FORÇA",null,null,"Neutro-Importante",-2,"AMEAÇA"]
["Atende razoavelmente-Muito importante",5,"FORÇA",null,null,"Favorável-Importante",8,"OPORTUNIDADE"]
["Atende totalmente-Insignificante",-10,"FRAQUEZA",null,null,"Desfavorável-Muito Importante",-10,"AMEAÇA"]
["Atende totalmente-Importante",8,"FORÇA",null,null,"Neutro-Muito Importante",-4,"AMEAÇA"]
["Atende totalmente-Muito importante",10,"FORÇA",null,null,"Favorável-Muito Importante",10,"OPORTUNIDADE"]